Target
Sodium channel protein type 9 subunit alpha
Ligand
BDBM145593
Substrate
Meas. Tech.
Electrophysiological Assay
Temperature
310.15±n/a K
IC50
2±n/a nM
Comments
extracted
Citation
 Andrez, JChowdhury, SDecker, SMDehnhardt, CMFocken, TGrimwood, MEHemeon, IWJia, QLi, JOrtwine, DFSafina, BSheng, TSun, SSutherlin, DPWilson, MSZenova, AY N-substituted benzamides and methods of use thereof US Patent  US8952169 Publication Date 2/10/2015 
Target
Name:
Sodium channel protein type 9 subunit alpha
Synonyms:
NENA Peripheral sodium channel 1 SCN9A_HUMAN Voltage-gated sodium channel subunit Nav1.7 hNE-Na
Type:
Protein
Mol. Mass.:
226375.97
Organism:
Homo sapiens (Human)
Description:
Q15858
Residue:
1988
  
Inhibitor
Name:
BDBM145593
Synonyms:
US8952169, 391
Type:
Small organic molecule
Emp. Form.:
C19H24FNO4S
Mol. Mass.:
381.462
SMILES:
CS(=O)(=O)NC(=O)c1cc(C2CC2)c(OCC2CCC3CC3C2)cc1F
: