Target
Sphingosine 1-phosphate receptor 2
Ligand
BDBM149706
Substrate
Meas. Tech.
Fluorescence-Based Assay
pH
7.2±n/a
Temperature
310.15±n/a K
IC50
3±n/a nM
Comments
extracted
Citation
 Naganawa, AKusumi, KOtsuki, KSekiguchi, TKakuuchi, AShinozaki, KYamamoto, HNonaka, S Phenyl derivative US Patent  US8975409 Publication Date 3/10/2015 
Target
Name:
Sphingosine 1-phosphate receptor 2
Synonyms:
EDG5 S1PR2 Sphingosine 1-phosphate receptor Sphingosine-1-phosphate receptor 2 | ndothelial differentiation G-protein coupled receptor 5
Type:
G Protein-Coupled Receptor (GPCR)
Mol. Mass.:
38883.16
Organism:
Homo sapiens (Human)
Description:
Membranes isolated from S1P2-transfected CHO cells were used in ligand binding assay.
Residue:
353
  
Inhibitor
Name:
BDBM149706
Synonyms:
US8975409, Example 13
Type:
Small organic molecule
Emp. Form.:
C34H39FN2O6
Mol. Mass.:
590.6817
SMILES:
CCC(CC)CC1(O)CCN(CC1)C(=O)Nc1cc(Oc2ccc(F)cc2)cc(Oc2ccc(cc2)C2(CC2)C(O)=O)c1
: