Target
Tyrosine-protein kinase JAK2
Ligand
BDBM286338
Substrate
Meas. Tech.
JAK Caliper Enzyme Assay at 1 mM ATP
pH
7.4±n/a
Temperature
298.15±n/a K
IC50
6.30±n/a nM
Comments
extracted
Citation
 Coe, JWDehnhardt, CMJones, PSabnis, YAStrohbach, JWWakenhut, FMWhitlock, GA Pyrazolopyridines and pyrazolopyrimidines US Patent  US9518052 Publication Date 12/13/2016 
Target
Name:
Tyrosine-protein kinase JAK2
Synonyms:
JAK-2 JAK2_HUMAN Janus kinase 2 (JAK2) | Janus kinase 2 (a protein tyrosine kinase)
Type:
Protein
Mol. Mass.:
130684.68
Organism:
Homo sapiens (Human)
Description:
O60674
Residue:
1132
  
Inhibitor
Name:
BDBM286338
Synonyms:
US9518052, Example 148
Type:
Small organic molecule
Emp. Form.:
C23H23F4N5O3S
Mol. Mass.:
525.519
SMILES:
CN(c1ccccc1CNc1nc(cc(N)c1C=N)-c1cc(F)c(O)cc1CC(F)(F)F)S(C)(=O)=O
: