Target
Poly-beta-1,6-N-acetyl-D-glucosamine N-deacetylase
Ligand
BDBM150805
Substrate
Meas. Tech.
Fluorogenic ACC Substrate Assay
pH
7.5±n/a
Ki
>1.000e+6±n/a nM
Comments
extracted
Citation
 Ariyakumaran, RPokrovskaya, VLittle, DJHowell, PLNitz, M Direct Staudinger-Phosphonite Reaction Provides Methylphosphonamidates as Inhibitors of CE4 De-N-acetylases. Chembiochem 16:1350-6 (2015)  
Target
Name:
Poly-beta-1,6-N-acetyl-D-glucosamine N-deacetylase
Synonyms:
PGAB_ECOLI pgaB | ycdR
Type:
Protein
Mol. Mass.:
77407.78
Organism:
Escherichia coli (Enterobacteria)
Description:
P75906
Residue:
672
  
Inhibitor
Name:
BDBM150805
Synonyms:
Sodium N-methylphosphate-1-O-methyl-4-O-benzyl-beta-D-glucosamine (15a)
Type:
Small organic molecule
Emp. Form.:
C15H23NNaO7P
Mol. Mass.:
383.3092
SMILES:
[Na+].CO[C@@H]1OC(CO)[C@@H](OCc2ccccc2)C(O)[C@@H]1NP(C)([O-])=O
: