Target
Urease [D459Y,K653P]
Ligand
BDBM152766
Substrate
Meas. Tech.
In vitro Urease Inhibition Assay
pH
8.2±n/a
IC50
3.64e+3±n/a nM
Comments
extracted
Citation
 Saeed, AImran, AChannar, PAShahid, MMahmood, WIqbal, J 2-(Hetero(aryl)methylene)hydrazine-1-carbothioamides as potent urease inhibitors. Chem Biol Drug Des 85:225-30 (2015)  
Target
Name:
Urease [D459Y,K653P]
Synonyms:
UREA_CANEN Urease
Type:
Protein
Mol. Mass.:
90763.23
Organism:
Canavalia ensiformis (Jack bean)
Description:
P07374[D459Y,K653P]
Residue:
840
  
Inhibitor
Name:
BDBM152766
Synonyms:
[(E)-{2-[4-(benzyloxy)phenyl]ethylidene}amino]thiourea (3k)
Type:
Small organic molecule
Emp. Form.:
C16H17N3OS
Mol. Mass.:
299.391
SMILES:
NC(=S)N\N=C\Cc1ccc(OCc2ccccc2)cc1
: