Target
Acetyl-CoA carboxylase 1
Ligand
BDBM152879
Substrate
Meas. Tech.
Inhibition Assay
pH
7.5±n/a
IC50
123±n/a nM
Comments
extracted
Citation
 Griffith, DADow, RLBagley, SWSmith, A N1/N2-lactam acetyl-CoA carboxylase inhibitors US Patent  US8993586 Publication Date 3/31/2015 
Target
Name:
Acetyl-CoA carboxylase 1
Synonyms:
ACAC ACACA_HUMAN ACC1 Acetyl-CoA carboxylase 1 | Acetyl-CoA carboxylase 1 (ACC1)
Type:
Protein
Mol. Mass.:
265543.22
Organism:
Homo sapiens (Human)
Description:
Q13085
Residue:
2346
  
Inhibitor
Name:
BDBM152879
Synonyms:
US8993586, 59
Type:
Small organic molecule
Emp. Form.:
C24H28N6O2
Mol. Mass.:
432.5181
SMILES:
CC(C)(C)n1cc2CC3(CCN(CC3)C(=O)c3ccc4cnc(N)cc4c3)NC(=O)c2n1
: