Target
Acetyl-CoA carboxylase 2
Ligand
BDBM152873
Substrate
Meas. Tech.
Inhibition Assay
IC50
4.4±n/a nM
Citation
 Griffith, DADow, RLBagley, SWSmith, A N1/N2-lactam acetyl-CoA carboxylase inhibitors US Patent  US8993586 Publication Date 3/31/2015 
Target
Name:
Acetyl-CoA carboxylase 2
Synonyms:
ACACB ACC-beta ACCB Acetyl-CoA carboxylase 2 Acetyl-CoA carboxylase 2 (ACC2)
Type:
Protein
Mol. Mass.:
276535.21
Organism:
Homo sapiens (Human)
Description:
O00763
Residue:
2458
  
Inhibitor
Name:
BDBM152873
Synonyms:
US8993586, 51
Type:
Small organic molecule
Emp. Form.:
C26H31N5O4
Mol. Mass.:
477.5554
SMILES:
COc1cccc2c(OC)cc(nc12)C(=O)N1CCC2(CC1)Cc1cn(nc1C(=O)N2)C(C)(C)C
: