Target
Prostaglandin G/H synthase 1
Ligand
BDBM50209568
Substrate
Meas. Tech.
COX1 and COX2 Inhibition Assay
pH
8±n/a
IC50
>1.50e+5±n/a nM
Comments
extracted
Citation
 Mascayano, CEspinosa, VSepúlveda-Boza, SHoobler, EKPerry, SDiaz, GHolman, TR Enzymatic Studies of Isoflavonoids as Selective and Potent Inhibitors of Human Leukocyte 5-Lipo-Oxygenase. Chem Biol Drug Des 86:114-21 (2015)  
Target
Name:
Prostaglandin G/H synthase 1
Synonyms:
COX1 Cyclooxygenase-1 (COX-1) PTGS1 | Prostaglandin G/H synthase (cyclooxygenase)
Type:
Protein
Mol. Mass.:
68868.60
Organism:
Ovis aries (Sheep)
Description:
Residue:
600
  
Inhibitor
Name:
BDBM50209568
Synonyms:
4',7,8-trihydroxyisoflavone 7,8-dihydroxy-3-(4-hydroxyphenyl)-4H-chromen-4-one IR-301
Type:
Small organic molecule
Emp. Form.:
C15H10O5
Mol. Mass.:
270.2369
SMILES:
Oc1ccc(cc1)-c1coc2c(O)c(O)ccc2c1=O
: