Target
Interleukin-1 receptor-associated kinase 1
Ligand
BDBM286217
Substrate
Meas. Tech.
IRAK1 Enzymatic Assay
IC50
<100±n/a nM
Citation
 Jorand-Lebrun, CKulkarni, SCrosignani, S Pyridazinone-amides derivatives US Patent  US9567320 Publication Date 2/14/2017 
Target
Name:
Interleukin-1 receptor-associated kinase 1
Synonyms:
IRAK IRAK1 Interleukin-1 receptor-associated kinase 1 (IRAK-1)
Type:
Enzyme
Mol. Mass.:
76536.81
Organism:
Homo sapiens (Human)
Description:
P51617
Residue:
712
  
Inhibitor
Name:
BDBM286217
Synonyms:
N-(1H-Benzoimidazol-2-yl)-3-(6-oxo-3-pyridin-3-yl-6H-pyridazin-1-ylmethyl)-benzamide | US9567320, Example 2
Type:
Small organic molecule
Emp. Form.:
C24H18N6O2
Mol. Mass.:
422.4387
SMILES:
O=C(Nc1nc2ccccc2[nH]1)c1cccc(Cn2nc(ccc2=O)-c2cccnc2)c1
: