Target
C-terminal-binding protein 2
Ligand
BDBM154570
Substrate
Meas. Tech.
CtBP2 ITC
pH
8.5±0
Kd
1.30e+3± 7e+1 nM
Citation
 Hilbert, BJMorris, BLEllis, KCPaulsen, JLSchiffer, CAGrossman, SRRoyer, WE Structure-guided design of a high affinity inhibitor to human CtBP. ACS Chem Biol 10:1118-27 (2015)  
Target
Name:
C-terminal-binding protein 2
Synonyms:
C-terminal-binding protein 2 CTBP2 | CTBP2_HUMAN
Type:
Protein
Mol. Mass.:
48948.33
Organism:
Homo sapiens (Human)
Description:
P56545
Residue:
445
  
Inhibitor
Name:
BDBM154570
Synonyms:
2-Hydroxyimino-3-phenylpropanoic acid (HIPP)
Type:
Small organic molecule
Emp. Form.:
C9H9NO3
Mol. Mass.:
179.1727
SMILES:
ON=C(Cc1ccccc1)C(O)=O
: