Target
Amyloid-beta precursor protein
Ligand
BDBM155142
Substrate
Meas. Tech.
Release Assay
Temperature
310.15±n/a K
IC50
4.5±n/a nM
Comments
extracted
Citation
 Karlstrom, SSandberg, LSoderman, PKolmodin, KOhberg, L Cyclohexane-1,2′-naphthalene-1′,2″-imidazol compounds and their use as BACE inhibitors US Patent  US9000184 Publication Date 4/7/2015 
Target
Name:
Amyloid-beta precursor protein
Synonyms:
A4 ABPP AICD-50 AICD-59 AID(57) APP Alzheimer disease amyloid protein Amyloid beta Protein Amyloid beta protein Abeta(1-42) Amyloid intracellular domain 57 Amyloid protein (Abeta42b) Beta amyloid A4 protein Beta-APP42 Beta-amyloid protein 42 C83 CVAP Gamma Secretase Gamma-CTF(57) Gamma-secretase Gamma-secretase C-terminal fragment 57 P3(40) PN-II Protease nexin-II S-APP-beta Soluble APP-beta | beta-Amyloid Precursor Protein (APP)
Type:
Single-pass type I membrane protein
Mol. Mass.:
86890.41
Organism:
Homo sapiens (Human)
Description:
P05067
Residue:
770
  
Inhibitor
Name:
BDBM155142
Synonyms:
US9000184, 11, isomer 1
Type:
Small organic molecule
Emp. Form.:
C26H27ClN4O
Mol. Mass.:
446.972
SMILES:
CO[C@H]1CC[C@@]2(CC1)CCc1ccc(cc1C21N=C(C)C(N)=N1)-c1cc(Cl)cc(c1)C#N
: