Target
Sodium/glucose cotransporter 2
Ligand
BDBM50353874
Substrate
Meas. Tech.
In Vitro Assay
pH
7.4±n/a
Temperature
310.15±n/a K
IC50
48.4±n/a nM
Comments
extracted
Citation
 Lee, JSong, KLee, SH Thiophene derivative as SGLT2 inhibitor and pharmaceutical composition comprising same US Patent  US9006187 Publication Date 4/14/2015 
Target
Name:
Sodium/glucose cotransporter 2
Synonyms:
Na(+)/glucose cotransporter 2 SGLT2 Sodium-Dependent Glucose Cotransporter 2 (SGLT2) Solute carrier family 5 member 2
Type:
Protein
Mol. Mass.:
72902.00
Organism:
Homo sapiens (Human)
Description:
P31639
Residue:
672
  
Inhibitor
Name:
BDBM50353874
Synonyms:
CHEMBL1830348 | US9006187, 7
Type:
Small organic molecule
Emp. Form.:
C19H23ClO5S2
Mol. Mass.:
430.966
SMILES:
CCSc1ccc(Cc2cc(sc2Cl)[C@@H]2O[C@H](CO)[C@@H](O)[C@H](O)[C@H]2O)cc1
: