Target
Methyl-CpG-binding domain protein 2
Ligand
BDBM158508
Substrate
Meas. Tech.
Binding Assay
IC50
11±n/a nM
Citation
 Nelson, WGYegnasubramanian, SLin, XSpeed, TJReichert, Z Agents for reversing epigenetic silencing of genes US Patent  US9034574 Publication Date 5/19/2015 
Target
Name:
Methyl-CpG-binding domain protein 2
Synonyms:
MBD2 Methyl-CpG binding domain protein 2 | Methyl-CpG-binding domain protein 2 (MBD2)
Type:
Enzyme Catalytic Domain
Mol. Mass.:
43278.74
Organism:
Homo sapiens (Human)
Description:
gi_21595776
Residue:
411
  
Inhibitor
Name:
BDBM158508
Synonyms:
US9034574, XVII
Type:
Small organic molecule
Emp. Form.:
C14H12N2OS
Mol. Mass.:
256.323
SMILES:
Oc1ccc(cc1)C1NN=C(S1)c1ccccc1
: