Target
Melanocyte-stimulating hormone receptor
Ligand
BDBM160165
Substrate
Meas. Tech.
Competitive Inhibition Assay
pH
7.5±n/a
Temperature
310.15±n/a K
Ki
0.5±n/a nM
Comments
extracted
Citation
 Dodd, JHShi, YYang, W Melanocortin receptor-specific peptides US Patent  US9040663 Publication Date 5/26/2015 
Target
Name:
Melanocyte-stimulating hormone receptor
Synonyms:
MC1-R MSH-R MSHR_HUMAN Melanocortin receptor (M1 and M4) Melanocortin receptor 1 (MC1-R) | Melanocortin receptor 1 (MC1R)
Type:
Enzyme
Mol. Mass.:
34717.23
Organism:
Homo sapiens (Human)
Description:
Q01726
Residue:
317
  
Inhibitor
Name:
BDBM160165
Synonyms:
US9040663, 11
Type:
Small organic molecule
Emp. Form.:
C48H70FN17O9
Mol. Mass.:
1048.1763
SMILES:
CC(=O)N[C@@H](CCCNC(N)=N)C(=O)N[C@H]1CCC(=O)NCCC[C@H](NC(=O)[C@H](Cc2c[nH]c3ccccc23)NC(=O)[C@H](CCCNC(N)=N)NC(=O)[C@@H](Cc2ccc(F)cc2)NC(=O)[C@H](CCN)NC1=O)C(N)=O
: