Target
Cyclin-dependent kinase 6
Ligand
BDBM164883
Substrate
Meas. Tech.
In Vitro Kinase Inhibition Assay
pH
7.5±n/a
IC50
>5000±n/a nM
Comments
extracted
Citation
 Zeitlmann, LNiestroj, AHeiser, U Inhibitors of protein kinases US Patent  US9067888 Publication Date 6/30/2015 
Target
Name:
Cyclin-dependent kinase 6
Synonyms:
CDK6 CDKN6 Cyclin-dependent kinase 6 (CDK 6) | Serine/threonine-protein kinase PLSTIRE
Type:
Enzyme Subunit
Mol. Mass.:
36937.42
Organism:
Homo sapiens (Human)
Description:
Q00534
Residue:
326
  
Inhibitor
Name:
BDBM164883
Synonyms:
US9067888, 33
Type:
Small organic molecule
Emp. Form.:
C21H24FN3O3
Mol. Mass.:
385.432
SMILES:
COc1cc(F)ccc1-c1ccnc(NC(=O)[C@H]2CCC[C@H](C2)NC(C)=O)c1
: