Target
Macrophage colony-stimulating factor 1 receptor
Ligand
BDBM164889
Substrate
Meas. Tech.
Inhibition Assay
pH
7.5±n/a
Temperature
298.15±n/a K
IC50
1±n/a nM
Comments
extracted
Citation
 Kane, Jr., JLMatthews, GMetz, MKothe, MLiu, JScholte, A Tropomyosin-related kinase (TRK) inhibitors US Patent  US9067914 Publication Date 6/30/2015 
Target
Name:
Macrophage colony-stimulating factor 1 receptor
Synonyms:
CSF1R FMS Macrophage colony stimulating factor receptor Macrophage colony-stimulating factor 1 receptor (c-FMS) Proto-oncogene c-Fms c-fms | cFMS
Type:
Protein
Mol. Mass.:
107979.48
Organism:
Homo sapiens (Human)
Description:
P07333
Residue:
972
  
Inhibitor
Name:
BDBM164889
Synonyms:
US10166239, Ex. 3-3 US9067914, Ex. 3-3
Type:
Small organic molecule
Emp. Form.:
C30H31N4O4P
Mol. Mass.:
542.5653
SMILES:
COc1ccc(COc2ccc(Cn3c(N)nc4cc(ccc34)-c3ccc(nc3)P(C)(C)=O)cc2OC)cc1
: