Target
Protease
Ligand
BDBM171361
Substrate
Meas. Tech.
Inhibition Assay
Ki
200±n/a nM
Citation
 Ghosh, AK Nonpeptide HIV-1 protease inhibitors US Patent  US9085571 Publication Date 7/21/2015 
Target
Name:
Protease
Synonyms:
Type:
Enzyme
Mol. Mass.:
10904.79
Organism:
Human immunodeficiency virus 1 (HIV-1)
Description:
Q9YQ12
Residue:
99
  
Inhibitor
Name:
BDBM171361
Synonyms:
US9085571, Table 1, Compound 9
Type:
Small organic molecule
Emp. Form.:
C37H50N4O6S
Mol. Mass.:
678.881
SMILES:
CNc1cc(cc(c1)C(=O)N(C)C1CCCCC1)C(=O)N[C@@H](Cc1ccccc1)[C@H](O)CN(CC(C)C)S(=O)(=O)c1ccc(OC)cc1
: