Target
Bile salt export pump
Ligand
BDBM172715
Substrate
Meas. Tech.
Inhibition Assay
Temperature
310.15±n/a K
IC50
180±n/a nM
Comments
extracted
Citation
 Gregory, MAMoss, SJWilkinson, B Compound and methods for its production US Patent  US9090657 Publication Date 7/28/2015 
Target
Name:
Bile salt export pump
Synonyms:
ABCB11 ATP-binding cassette sub-family B member 11 Bile Salt Export Pump, BSEP Bile salt export pump (BSEP)
Type:
Protein
Mol. Mass.:
146405.49
Organism:
Homo sapiens (Human)
Description:
O95342
Residue:
1321
  
Inhibitor
Name:
BDBM172715
Synonyms:
US9090657, DEBIO-025, 2
Type:
Small organic molecule
Emp. Form.:
C63H113N11O12
Mol. Mass.:
1216.6378
SMILES:
CCC1NC(=O)C(C(O)C(C)C\C=C\C)N(C)C(=O)C(C(C)C)N(C)C(=O)C(CC(C)C)N(C)C(=O)C(CC(C)C)N(C)C(=O)C(C)NC(=O)C(C)NC(=O)C(CC(C)C)N(C)C(=O)C(NC(=O)C(C(C)C)N(CC)C(=O)C(C)N(C)C1=O)C(C)C
: