Target
Prostaglandin G/H synthase 1
Ligand
BDBM175282
Substrate
Meas. Tech.
In vitro Cyclooxygenase Inhibition Assay
IC50
1.51e+4±n/a nM
Citation
 Abdellatif, KRAbdelgawad, MAElshemy, HAAlsayed, SS Design, synthesis and biological screening of new 4-thiazolidinone derivatives with promising COX-2 selectivity, anti-inflammatory activity and gastric safety profile. Bioorg Chem 64:1-12 (2016)  
Target
Name:
Prostaglandin G/H synthase 1
Synonyms:
COX1 Cyclooxygenase-1 (COX-1) PTGS1 | Prostaglandin G/H synthase (cyclooxygenase)
Type:
Protein
Mol. Mass.:
68868.60
Organism:
Ovis aries (Sheep)
Description:
Residue:
600
  
Inhibitor
Name:
BDBM175282
Synonyms:
2-(4-(4-Methanesulfonamidophenyl)thiazol-2-ylimino)thiazolidin-4-one (4c)
Type:
Small organic molecule
Emp. Form.:
C13H12N4O3S3
Mol. Mass.:
368.454
SMILES:
CS(=O)(=O)Nc1ccc(cc1)-c1csc(\N=C2\NC(=O)CS2)n1
: