Target
Glycylpeptide N-tetradecanoyltransferase
Ligand
BDBM185052
Substrate
Meas. Tech.
Enzyme Inhibition Assay
pH
7.4±n/a
Temperature
298.15±n/a K
IC50
3±n/a nM
Comments
extracted
Citation
 Brand, SWyatt, PThompson, SSmith, VBayliss, THarrison, JNorcross, NCleghorn, LGilbert, IBrenk, R N-myristoyl transferase inhibitors US Patent  US9156811 Publication Date 10/13/2015 
Target
Name:
Glycylpeptide N-tetradecanoyltransferase
Synonyms:
N-myristoyltransferase (NMT1)
Type:
Protein
Mol. Mass.:
50529.16
Organism:
Trypanosoma brucei
Description:
Q388H8
Residue:
446
  
Inhibitor
Name:
BDBM185052
Synonyms:
US9156811, DDD100094
Type:
Small organic molecule
Emp. Form.:
C27H36N4O2S
Mol. Mass.:
480.665
SMILES:
CC(C)Cc1nn(C)c(C)c1N[S+]([O-])(=O)c1ccc(cc1)-c1cccc(CC2CCNCC2)c1
: