Target
Glycylpeptide N-tetradecanoyltransferase
Ligand
BDBM185075
Substrate
Meas. Tech.
Enzyme Inhibition Assay
pH
7.4±n/a
Temperature
298.15±n/a K
IC50
2±n/a nM
Comments
extracted
Citation
 Brand, SWyatt, PThompson, SSmith, VBayliss, THarrison, JNorcross, NCleghorn, LGilbert, IBrenk, R N-myristoyl transferase inhibitors US Patent  US9156811 Publication Date 10/13/2015 
Target
Name:
Glycylpeptide N-tetradecanoyltransferase
Synonyms:
N-myristoyltransferase (NMT1)
Type:
Protein
Mol. Mass.:
50529.16
Organism:
Trypanosoma brucei
Description:
Q388H8
Residue:
446
  
Inhibitor
Name:
BDBM185075
Synonyms:
US9156811, DDD100161
Type:
Small organic molecule
Emp. Form.:
C23H32Cl2F2N4O3S
Mol. Mass.:
553.493
SMILES:
CN1CCC(CC1)OCCCc1cc(Cl)c(c(Cl)c1)[S+]([O-])(=O)N(CC(F)F)c1c(C)nn(C)c1C
: