Target
Glycylpeptide N-tetradecanoyltransferase 1
Ligand
BDBM184854
Substrate
Meas. Tech.
Enzyme Inhibition Assay
pH
7.4±n/a
Temperature
298.15±n/a K
IC50
3±n/a nM
Comments
extracted
Citation
 Brand, SWyatt, PThompson, SSmith, VBayliss, THarrison, JNorcross, NCleghorn, LGilbert, IBrenk, R N-myristoyl transferase inhibitors US Patent  US9156811 Publication Date 10/13/2015 
Target
Name:
Glycylpeptide N-tetradecanoyltransferase 1
Synonyms:
Myristoyl-CoA:protein N-myristoyltransferase (Nmt) NMT NMT1_HUMAN Peptide N-myristoyltransferase 1
Type:
Enzyme
Mol. Mass.:
56814.10
Organism:
Homo sapiens (Human)
Description:
P30419
Residue:
496
  
Inhibitor
Name:
BDBM184854
Synonyms:
US9156811, DDD86206
Type:
Small organic molecule
Emp. Form.:
C21H25ClN6O2S
Mol. Mass.:
460.98
SMILES:
Cc1nn(C)c(C)c1N[S+]([O-])(=O)c1ccc(cc1Cl)-c1ccnc(c1)N1CCNCC1
: