Target
Sodium channel protein type 9 subunit alpha
Ligand
BDBM186023
Substrate
Meas. Tech.
Electrophysiology Assay
Ki
20±n/a nM
Citation
 Goehring, RRTafesse, LYao, J Quinazoline compounds as sodium channel blockers US Patent  US9168255 Publication Date 10/27/2015 
Target
Name:
Sodium channel protein type 9 subunit alpha
Synonyms:
NENA Peripheral sodium channel 1 SCN9A_HUMAN Voltage-gated sodium channel subunit Nav1.7 hNE-Na
Type:
Protein
Mol. Mass.:
226375.97
Organism:
Homo sapiens (Human)
Description:
Q15858
Residue:
1988
  
Inhibitor
Name:
BDBM186023
Synonyms:
US9168255, 13t
Type:
Small organic molecule
Emp. Form.:
C29H29FN4O
Mol. Mass.:
468.5652
SMILES:
CN1[C@H]2CCC[C@@H]1C[C@@H](C2)Nc1nc(-c2ccc(Oc3ccc(F)cc3)cc2)c2ccccc2n1
: