Target
5-hydroxytryptamine receptor 1A
Ligand
BDBM186938
Substrate
Meas. Tech.
Radioligand Binding Assay
pH
7.4±n/a
Ki
1469±n/a nM
Comments
extracted
Citation
 Besnard, JHopkins, ALGilbert, IRuda, GFAbecassis, K Morpholino compounds, uses and methods US Patent  US9079895 Publication Date 7/14/2015 
Target
Name:
5-hydroxytryptamine receptor 1A
Synonyms:
5-HT1A 5-hydroxytryptamine receptor 1A (5HT1A) Gpcr18 Serotonin 1a (5-HT1a) receptor
Type:
Enzyme
Mol. Mass.:
46192.09
Organism:
Mus musculus (Mouse)
Description:
Q64264
Residue:
421
  
Inhibitor
Name:
BDBM186938
Synonyms:
US9079895, 25r
Type:
Small organic molecule
Emp. Form.:
C22H26N2O4
Mol. Mass.:
382.4528
SMILES:
COc1cccc(OC[C@H]2CN(CC(=O)N3CCc4ccccc34)CCO2)c1
: