Target
5-hydroxytryptamine receptor 2B
Ligand
BDBM186933
Substrate
Meas. Tech.
Radioligand Binding Assay
pH
7.4±n/a
Ki
1846±n/a nM
Comments
extracted
Citation
 Besnard, JHopkins, ALGilbert, IRuda, GFAbecassis, K Morpholino compounds, uses and methods US Patent  US9079895 Publication Date 7/14/2015 
Target
Name:
5-hydroxytryptamine receptor 2B
Synonyms:
5-HT2 5-hydroxytryptamine receptor 2B 5HT2B_MOUSE Htr2b
Type:
Enzyme
Mol. Mass.:
53610.91
Organism:
Mus musculus (Mouse)
Description:
Q02152
Residue:
479
  
Inhibitor
Name:
BDBM186933
Synonyms:
US9079895, 23r
Type:
Small organic molecule
Emp. Form.:
C21H25ClN2O2
Mol. Mass.:
372.888
SMILES:
Clc1cccc(OC[C@H]2CN(CCN3CCc4ccccc34)CCO2)c1
: