Target
Alpha-1D adrenergic receptor
Ligand
BDBM186957
Substrate
Meas. Tech.
Radioligand Binding Assay
pH
7.4±n/a
Ki
>10000±n/a nM
Comments
extracted
Citation
 Besnard, JHopkins, ALGilbert, IRuda, GFAbecassis, K Morpholino compounds, uses and methods US Patent  US9079895 Publication Date 7/14/2015 
Target
Name:
Alpha-1D adrenergic receptor
Synonyms:
ADA1D_MOUSE Adra1d Gpcr8 | adrenergic Alpha2
Type:
Enzyme
Mol. Mass.:
59890.14
Organism:
Mus musculus (Mouse)
Description:
P97714
Residue:
562
  
Inhibitor
Name:
BDBM186957
Synonyms:
US9079895, 61
Type:
Small organic molecule
Emp. Form.:
C22H27N3O3
Mol. Mass.:
381.4681
SMILES:
C[C@@H]1Cc2ccccc2N1C(=O)CN1CCO[C@H](COc2cccnc2C)C1
: