Target
Interleukin-1 receptor-associated kinase 4
Ligand
BDBM188859
Substrate
Meas. Tech.
Kinase Assay
pH
7.2±n/a
IC50
<100±n/a nM
Comments
extracted
Citation
 McElroy, WTLi, GHo, GDTan, ZPaliwal, SSeganish, WMTulshian, DLampe, JMethot, JLZhou, HAltman, MDZhu, L Amidopyrazole inhibitors of interleukin receptor-associated kinases US Patent  US9169260 Publication Date 10/27/2015 
Target
Name:
Interleukin-1 receptor-associated kinase 4
Synonyms:
IRAK-4 IRAK4_HUMAN Interleukin-1 receptor-associated kinase 4 (IRAK4) | Renal carcinoma antigen NY-REN-64
Type:
Protein
Mol. Mass.:
51519.08
Organism:
Homo sapiens (Human)
Description:
Q9NWZ3
Residue:
460
  
Inhibitor
Name:
BDBM188859
Synonyms:
US9169260, 125
Type:
Small organic molecule
Emp. Form.:
C22H17N7O
Mol. Mass.:
395.4167
SMILES:
Cc1ccc(cc1)-n1nc(cc1NC(=O)c1cnn2cccnc12)-c1ccncc1
: