Target
Cyclin-A2 [171-432]/Cyclin-dependent kinase 2
Ligand
BDBM5525
Substrate
Histone H1
Meas. Tech.
Kinase Inhibition Assay
pH
7.5±n/a
Temperature
303.15±n/a K
IC50
2800±900 nM
Citation
 Hardcastle, IRArris, CEBentley, JBoyle, FTChen, YCurtin, NJEndicott, JAGibson, AEGolding, BTGriffin, RJJewsbury, PMenyerol, JMesguiche, VNewell, DRNoble, MEPratt, DJWang, LZWhitfield, HJ N2-substituted O6-cyclohexylmethylguanine derivatives: potent inhibitors of cyclin-dependent kinases 1 and 2. J Med Chem 47:3710-22 (2004)  
Target
Name:
Cyclin-A2 [171-432]/Cyclin-dependent kinase 2
Synonyms:
CDK2/cyclin A3 p33cdk2/cyclin A3
Type:
Protein Complex
Mol. Mass.:
Description:
Binary complex of CDK2-cyclin A3 was formed by adding cyclin A3 in slight molar excess to the CDK2 subunit and purified by Superdex 75 gel filtration chromatography.
Components:
This complex has 2 components.
Component 1
Name:
Cyclin-dependent kinase 2
Synonyms:
CDK2 CDK2_HUMAN Cell division protein kinase 2 Protein cereblon/Cyclin-dependent kinase 2 | p33 protein kinase
Type:
Enzyme Subunit
Mol. Mass.:
33938.17
Organism:
Homo sapiens (Human)
Description:
P24941
Residue:
298
  
Component 2
Name:
Cyclin-A2 [171-432]
Synonyms:
CCN1 CCNA2 cyclin A2
Type:
Enzyme Subunit
Mol. Mass.:
30018.91
Organism:
Homo sapiens (Human)
Description:
cyclin A2 is a c-terminal cyclin A fragment encoding residues 171-432.
Residue:
262
  
Inhibitor
Name:
BDBM5525
Synonyms:
2-{[6-(cyclohexylmethoxy)-9H-purin-2-yl]amino}ethan-1-ol O6-Cyclohexylmethylguanine deriv. 10
Type:
Small organic molecule
Emp. Form.:
C14H21N5O2
Mol. Mass.:
291.3488
SMILES:
OCCNc1nc(OCC2CCCCC2)c2[nH]cnc2n1
:
Substrate
Name:
Histone H1
Synonyms:
Sigma Type IIIS
Type:
Other Protein Type
Mol. Mass.:
358.43
Organism:
Bos taurus (bovine)
Description:
12.5 uM ATP as co-substrate.
Residue:
3
NA