Target
Enoyl-[acyl-carrier-protein] reductase [NADH] [T276S]
Ligand
BDBM16296
Substrate
Meas. Tech.
Inhibition Kinetics
IC50
>1.00e+5±n/a nM
Citation
 Neckles, CPschibul, ALai, CTHirschbeck, MKuper, JDavoodi, SZou, JLiu, NPan, PShah, SDaryaee, FBommineni, GRLai, CSimmerling, CKisker, CTonge, PJ Selectivity of Pyridone- and Diphenyl Ether-Based Inhibitors for the Yersinia pestis FabV Enoyl-ACP Reductase. Biochemistry 55:2992-3006 (2016)  
Target
Name:
Enoyl-[acyl-carrier-protein] reductase [NADH] [T276S]
Synonyms:
Enoyl-ACP reductase T276S (T276S ypFabV) fabV
Type:
Protein
Mol. Mass.:
43321.97
Organism:
Yersinia pestis (Enterobacteria)
Description:
B1JRQ0[T276S]
Residue:
399
  
Inhibitor
Name:
BDBM16296
Synonyms:
5-Pentyl-2-phenoxy-phenol 5-pentyl-2-phenoxyphenol AIDS227445 | PT03
Type:
Small organic molecule
Emp. Form.:
C17H20O2
Mol. Mass.:
256.3395
SMILES:
CCCCCc1ccc(Oc2ccccc2)c(O)c1
: