Target
Adenosine receptor A3 [I248L]
Ligand
BDBM191053
Substrate
Meas. Tech.
Radioligand Binding Assay
pH
7.5±n/a
Temperature
298.15±n/a K
Ki
315±48 nM
Comments
extracted
Citation
 Jacobson, KATosh, DK Adenosine receptor agonists, partial agonists, and antagonists US Patent  US9181253 Publication Date 11/10/2015 
Target
Name:
Adenosine receptor A3 [I248L]
Synonyms:
AA3R_HUMAN Adenosine receptor A3 | Adenosine receptor A3 (A3)
Type:
Protein
Mol. Mass.:
36197.32
Organism:
Homo sapiens (Human)
Description:
P0DMS8[I248L]
Residue:
318
  
Inhibitor
Name:
BDBM191053
Synonyms:
US9181253, 113
Type:
Small organic molecule
Emp. Form.:
C18H22ClN5O2
Mol. Mass.:
375.853
SMILES:
O[C@H]1C[C@]2(C[C@H]2[C@H]1O)n1cnc2c(NC3CC4CCC3C4)nc(Cl)nc12
: