Target
Histamine H3 receptor
Ligand
BDBM50434335
Substrate
Meas. Tech.
Biological Assay
Temperature
298.15±n/a K
Ki
0.02±n/a nM
Comments
extracted
Citation
 Cowart, MDLiu, HAltenbach, R Mercaptoamidine derivatives and methods of use US Patent  US9181275 Publication Date 11/10/2015 
Target
Name:
Histamine H3 receptor
Synonyms:
HH3R Hrh3
Type:
G Protein-Coupled Receptor (GPCR)
Mol. Mass.:
48607.98
Organism:
Rattus norvegicus (rat)
Description:
Residue:
445
  
Inhibitor
Name:
BDBM50434335
Synonyms:
CHEMBL2386729 | US9181275, 3
Type:
Small organic molecule
Emp. Form.:
C26H31N3OS
Mol. Mass.:
433.609
SMILES:
C[C@@H]1CCCN1CCCOc1ccc(cc1)C1=C(C)N2Cc3ccccc3CN=C2S1
: