Target
Adenosine receptor A1
Ligand
BDBM191809
Substrate
Meas. Tech.
Luciferase Assay
pH
7.4±n/a
Temperature
310.15±n/a K
EC50
0.7±n/a nM
Comments
extracted
Citation
 Vakalopoulos, AMeibom, DNell, PSussmeier, FAlbrecht-Kupper, BZimmermann, KKeldenich, JSchneider, DKrenz, U Substituted dicyanopyridines and use thereof US Patent  US9187428 Publication Date 11/17/2015 
Target
Name:
Adenosine receptor A1
Synonyms:
A1 adenosine receptor (hA1) AA1R_HUMAN ADORA1 Adenosine A1-receptor Adenosine receptor A1 (hA1) | Adenosine transporter (AdT)
Type:
G Protein-Coupled Receptor (GPCR)
Mol. Mass.:
36520.92
Organism:
Homo sapiens (Human)
Description:
P30542
Residue:
326
  
Inhibitor
Name:
BDBM191809
Synonyms:
US9187428, 37
Type:
Small organic molecule
Emp. Form.:
C21H16FN5O2S2
Mol. Mass.:
453.512
SMILES:
CS(=O)(=O)Nc1cccc(CSc2nc(N)c(C#N)c(-c3ccc(F)cc3)c2C#N)c1
: