Target
IspB protein
Ligand
BDBM12578
Substrate
Meas. Tech.
Fluorescent Assay
IC50
2.2e+2± 1e+1 nM
Citation
 Teng, KHHsu, ETChang, YHLin, SWLiang, PH Fluorescent Farnesyl Diphosphate Analogue: A Probe To Validate trans-Prenyltransferase Inhibitors. Biochemistry 55:4366-74 (2016)  
Target
Name:
IspB protein
Synonyms:
Octaprenyl diphosphate synthase (OPPS)
Type:
Protein
Mol. Mass.:
35199.45
Organism:
Escherichia coli (Enterobacteria)
Description:
Residue:
323
  
Inhibitor
Name:
BDBM12578
Synonyms:
2-(imidazol-1-yl)-1-hydroxyethylidene-1,1-bisphosphonic acid CGP-42446 JMC515594 Compound 55 US11279719, Example Zolendronic acid (ZOL) Zoledronate [1-hydroxy-2-(1H-imidazol-1-yl)-1-phosphonoethyl]phosphonic acid | zoledronic acid
Type:
Small organic molecule
Emp. Form.:
C5H10N2O7P2
Mol. Mass.:
272.0896
SMILES:
OC(Cn1ccnc1)(P(O)(O)=O)P(O)(O)=O
: