Target
Macrophage colony-stimulating factor 1 receptor [555-568]
Ligand
BDBM198858
Substrate
Meas. Tech.
Fluorescence Polarization Competition Immunoassay
pH
7.5±n/a
IC50
2.6±n/a nM
Comments
extracted
Citation
 Illig, CRBallentine, SKChen, JDesjarlais, RLMeegalla, SKWall, MWilson, K Inhibitors of c-fms kinase US Patent  US9221797 Publication Date 12/29/2015 
Target
Name:
Macrophage colony-stimulating factor 1 receptor [555-568]
Synonyms:
CSF1R FMS FMS Substrate Peptide (aa 555-568) | Macrophage colony-stimulating factor 1 receptor (CSF1R) or (c-fms)
Type:
Peptide
Mol. Mass.:
1619.64
Organism:
Homo sapiens (Human)
Description:
P07333 aa 555-568
Residue:
14
SYEGNSYTFIDPTQ
  
Inhibitor
Name:
BDBM198858
Synonyms:
US9221797, 21
Type:
Small organic molecule
Emp. Form.:
C26H35N5O2
Mol. Mass.:
449.5884
SMILES:
COCCN(C)C(C)(C)c1ccc(NC(=O)c2nc(c[nH]2)C#N)c(c1)C1=CCC(C)(C)CC1
: