Target
Acetylcholinesterase
Ligand
BDBM8960
Substrate
Meas. Tech.
Cholinesterase Inhibition Assay
pH
8±n/a
Temperature
298.15±n/a K
IC50
4e+1± 2 nM
Comments
extracted
Citation
 Osman, WMohamed, TSit, VMVasefi, MSBeazely, MARao, PP Structure-activity relationship studies of benzyl-, phenethyl-, and pyridyl-substituted tetrahydroacridin-9-amines as multitargeting agents to treat Alzheimer's disease. Chem Biol Drug Des 88:710-723 (2016)  
Target
Name:
Acetylcholinesterase
Synonyms:
ACES_HUMAN Acetylcholinesterase (AChE) | Acetylcholinesterase (human AChE)
Type:
Enzyme
Mol. Mass.:
67792.70
Organism:
Homo sapiens (Human)
Description:
P22303
Residue:
614
  
Inhibitor
Name:
BDBM8960
Synonyms:
(+/-)-2-[(1-benzylpiperidin-4-yl)methyl]-5,6-dimethoxy-indan-1-one Aricept CHEMBL1678 CHEMBL502 Donepezil E2020 US9346818, DPH US9663465, Donepezil
Type:
Small organic molecule
Emp. Form.:
C24H29NO3
Mol. Mass.:
379.492
SMILES:
COc1cc2CC(CC3CCN(Cc4ccccc4)CC3)C(=O)c2cc1OC
: