Target
6-phosphofructo-2-kinase/fructose-2,6-bisphosphatase 3
Ligand
BDBM200940
Substrate
Meas. Tech.
Kinase Assay (Method B)
IC50
280±n/a nM
Citation
 Bystrom, SHedgecock, CHoman, ELundback, TMartinsson, JSari, MFarnegardh, KJonsson, M Sulfonamide compounds US Patent  US9233946 Publication Date 1/12/2016 
Target
Name:
6-phosphofructo-2-kinase/fructose-2,6-bisphosphatase 3
Synonyms:
6-phosphofructo-2-kinase 6-phosphofructo-2-kinase/fructose-2,6-bisphosphatase 3 (PFKFB3) 6PF-2-K/Fru-2,6-P2ase brain/placenta-type isozyme Fructose-2,6-bisphosphatase PFKFB3 iPFK-2
Type:
Enzyme
Mol. Mass.:
59620.59
Organism:
Homo sapiens (Human)
Description:
Q16875
Residue:
520
  
Inhibitor
Name:
BDBM200940
Synonyms:
US9233946, 39
Type:
Small organic molecule
Emp. Form.:
C16H13N5O2S2
Mol. Mass.:
371.437
SMILES:
Cc1c(sc2ccccc12)S(=O)(=O)Nc1cccc(c1)-c1nnn[nH]1
: