Target
6-phosphofructo-2-kinase/fructose-2,6-bisphosphatase 4
Ligand
BDBM201003
Substrate
Meas. Tech.
Kinase Assay (Method B)
IC50
660±n/a nM
Citation
 Bystrom, SHedgecock, CHoman, ELundback, TMartinsson, JSari, MFarnegardh, KJonsson, M Sulfonamide compounds US Patent  US9233946 Publication Date 1/12/2016 
Target
Name:
6-phosphofructo-2-kinase/fructose-2,6-bisphosphatase 4
Synonyms:
6-phosphofructo-2-kinase/fructose-2,6-bisphosphatase 4 (PFKFB4) PFKFB4
Type:
Enzyme
Mol. Mass.:
54039.68
Organism:
Homo sapiens (Human)
Description:
Q16877
Residue:
469
  
Inhibitor
Name:
BDBM201003
Synonyms:
US9233946, 102
Type:
Small organic molecule
Emp. Form.:
C17H11ClFN5O2S2
Mol. Mass.:
435.883
SMILES:
Fc1ccc(cc1Cl)-c1ccc(s1)S(=O)(=O)Nc1cccc(c1)-c1nnn[nH]1
: