Target
Protein-glutamine gamma-glutamyltransferase 2
Ligand
BDBM204908
Substrate
Meas. Tech.
TGM2 Inhibitory Activity Assay
pH
7.5±n/a
Temperature
298.15±n/a K
IC50
200±n/a nM
Comments
extracted
Citation
 Szillat, HLeeuw, TLorenz, M Isothiazolopyridine-2-carboxamides and their use as pharmaceuticals US Patent  US9260454 Publication Date 2/16/2016 
Target
Name:
Protein-glutamine gamma-glutamyltransferase 2
Synonyms:
Protein-glutamine gamma-glutamyltransferase TGM2 Tissue transglutaminase Transglutaminase 2 (TGM2) Transglutaminase-2
Type:
Protein
Mol. Mass.:
77309.30
Organism:
Homo sapiens (Human)
Description:
P21980
Residue:
687
  
Inhibitor
Name:
BDBM204908
Synonyms:
US9260454, 63 | US9260454, 85
Type:
Small organic molecule
Emp. Form.:
C11H13N5O5S2
Mol. Mass.:
359.381
SMILES:
NS(=O)(=O)N1CCN(CC1)C(=O)n1sc2[n+]([O-])cccc2c1=O
: