Target
Protein O-GlcNAcase
Ligand
BDBM205423
Substrate
Meas. Tech.
pH
7±n/a
Temperature
298.15±n/a K
Ki
0.5±n/a nM
Comments
extracted
Citation
 Kaul, RMcEachern, EJSelnick, HGVocadlo, DJZhou, YZhu, Y Selective glycosidase inhibitors and uses thereof US Patent  US9243020 Publication Date 1/26/2016 
Target
Name:
Protein O-GlcNAcase
Synonyms:
2-acetamido-2-deoxy-β-D-glucopyranosidase (O-GlcNAcase) Beta-hexosaminidase (O-GlcNAcase) HEXC MEA5 N-acetyl-beta-D-glucosaminidase (O-GlcNAcase) OGA Protein O-GlcNAcase
Type:
Enzyme
Mol. Mass.:
102874.67
Organism:
Homo sapiens (Human)
Description:
O60502
Residue:
916
  
Inhibitor
Name:
BDBM205423
Synonyms:
US9243020, 17 | US9815861, Example 17
Type:
Small organic molecule
Emp. Form.:
C8H13FN2O3S
Mol. Mass.:
236.264
SMILES:
CNC1=N[C@H]2[C@H](O[C@H](CF)[C@@H](O)[C@@H]2O)S1
: