Target
Acyl-protein thioesterase 2 [H152R]
Ligand
BDBM207991
Substrate
Meas. Tech.
Steady-State Kinetic Assays
pH
6.5±n/a
Ki
>10000±n/a nM
Comments
extracted
Citation
 Won, SJDavda, DLabby, KJHwang, SYPricer, RMajmudar, JDArmacost, KARodriguez, LARodriguez, CLChong, FSTorossian, KAPalakurthi, JHur, ESMeagher, JLBrooks, CLStuckey, JAMartin, BR Molecular Mechanism for Isoform-Selective Inhibition of Acyl Protein Thioesterases 1 and 2 (APT1 and APT2). ACS Chem Biol 11:3374-3382 (2016)  
Target
Name:
Acyl-protein thioesterase 2 [H152R]
Synonyms:
APT2 LYPA2_HUMAN | LYPLA2
Type:
Protein
Mol. Mass.:
24759.78
Organism:
Homo sapiens (Human)
Description:
Human APT2 with H152R mutation
Residue:
231
  
Inhibitor
Name:
BDBM207991
Synonyms:
ML348
Type:
Small organic molecule
Emp. Form.:
C18H17ClF3N3O3
Mol. Mass.:
415.794
SMILES:
FC(F)(F)c1ccc(Cl)c(NC(=O)CN2CCN(CC2)C(=O)c2ccco2)c1
: