Target
Acyl-protein thioesterase 2
Ligand
BDBM207995
Substrate
Meas. Tech.
Fluorescence Binding Assays
Temperature
298.15±n/a K
IC50
>1.00e+5±n/a nM
Kd
>10000±0.0 nM
Comments
extracted
Citation
 Won, SJDavda, DLabby, KJHwang, SYPricer, RMajmudar, JDArmacost, KARodriguez, LARodriguez, CLChong, FSTorossian, KAPalakurthi, JHur, ESMeagher, JLBrooks, CLStuckey, JAMartin, BR Molecular Mechanism for Isoform-Selective Inhibition of Acyl Protein Thioesterases 1 and 2 (APT1 and APT2). ACS Chem Biol 11:3374-3382 (2016)  
Target
Name:
Acyl-protein thioesterase 2
Synonyms:
APT2 LYPA2_HUMAN Lysophospholipase II
Type:
Protein
Mol. Mass.:
24740.23
Organism:
Homo sapiens (Human)
Description:
O95372
Residue:
231
  
Inhibitor
Name:
BDBM207995
Synonyms:
ML349-thioether
Type:
Small organic molecule
Emp. Form.:
C23H22N2O2S2
Mol. Mass.:
422.563
SMILES:
COc1ccc(cc1)N1CCN(CC1)C(=O)c1cc2CSc3ccccc3-c2s1
: