Target
C-X-C chemokine receptor type 3/Guanine nucleotide-binding protein subunit alpha-15
Ligand
BDBM208590
Substrate
Meas. Tech.
FLIPR Assay
pH
7.4±n/a
Temperature
310.15±n/a K
IC50
2±n/a nM
Comments
extracted
Citation
 Caroff, EKeller, MKimmerlin, TMeyer, E 4-(benzoimidazol-2-yl)-thiazole compounds and related aza derivatives US Patent  US9266876 Publication Date 2/23/2016 
Target
Name:
C-X-C chemokine receptor type 3/Guanine nucleotide-binding protein subunit alpha-15
Synonyms:
CXCR3A / G protein (Galpha(16))
Type:
Protein
Mol. Mass.:
Description:
Components:
This complex has 2 components.
Component 1
Name:
C-X-C chemokine receptor type 3
Synonyms:
AAO92295.1 C-X-C chemokine receptor type 3 (CXCR3) CXCR3 CXCR3_HUMAN chemokine (C-X-C motif) receptor 3
Type:
Enzyme Catalytic Domain
Mol. Mass.:
40665.65
Organism:
Homo sapiens (Human)
Description:
Residue:
368
  
Component 2
Name:
Guanine nucleotide-binding protein subunit alpha-15
Synonyms:
G-protein subunit alpha-16 GNA15 GNA16 | guanine nucleotide-binding protein subunit alpha-15
Type:
Protein
Mol. Mass.:
43577.62
Organism:
Homo sapiens (Human)
Description:
P30679
Residue:
374
  
Inhibitor
Name:
BDBM208590
Synonyms:
US9266876, 57
Type:
Small organic molecule
Emp. Form.:
C25H24N6OS
Mol. Mass.:
456.563
SMILES:
Cc1cccc2ccn(CC(=O)N3CCN(CC3)c3scnc3-c3nc4ccccc4[nH]3)c12
: