Target
cAMP and cAMP-inhibited cGMP 3',5'-cyclic phosphodiesterase 10A
Ligand
BDBM208969
Substrate
Meas. Tech.
Fluorescence Polarization Assay
pH
7.2±n/a
Temperature
298.15±n/a K
Ki
19±n/a nM
Comments
extracted
Citation
 Barrow, JCCox, CDNolt, MBShipe, WD Triazolopyridinone PDE10 inhibitors US Patent  US9266881 Publication Date 2/23/2016 
Target
Name:
cAMP and cAMP-inhibited cGMP 3',5'-cyclic phosphodiesterase 10A
Synonyms:
3',5'-cyclic phosphodiesterase PDE10_HUMAN Phosphodiesterase 10A
Type:
Protein
Mol. Mass.:
88412.52
Organism:
Homo sapiens (Human)
Description:
Q9Y233
Residue:
779
  
Inhibitor
Name:
BDBM208969
Synonyms:
US9266881, A-6
Type:
Small organic molecule
Emp. Form.:
C22H23N5O
Mol. Mass.:
373.4509
SMILES:
O=c1n(CCc2ccc3ccccc3n2)nc2cccc(N3CCCCC3)n12
: