Target
Bcl-2-like protein 1
Ligand
BDBM209225
Substrate
Meas. Tech.
Time Resolved-Fluorescence Resonance Energy Transfer (TR-FRET) Assay
Temperature
298.15±n/a K
Ki
<0.1±n/a nM
Comments
extracted
Citation
 Wang, LDoherty, GWang, XTao, ZBruncko, MKunzer, ARWendt, MDSong, XFrey, RHansen, TMSullivan, GMJudd, ASouers, A Apoptosis-inducing agents for the treatment of cancer and immune and autoimmune diseases US Patent  US9266877 Publication Date 2/23/2016 
Target
Name:
Bcl-2-like protein 1
Synonyms:
Anti-apoptotic Bcl-2 protein Apoptosis regulator Bcl-X BCL2-like 1 isoform 1 BCL2L1 Bcl-2-like protein 1 (Bcl-XL) Bcl-xL/Bcl-2-binding component 3 Bcl2-antagonist of cell death (BAD)
Type:
Mitochondrion membrane; Single-pass membrane protein
Mol. Mass.:
26039.60
Organism:
Homo sapiens (Human)
Description:
Residue:
233
  
Inhibitor
Name:
BDBM209225
Synonyms:
US9266877, 171
Type:
Small organic molecule
Emp. Form.:
C37H37N7O4S2
Mol. Mass.:
707.864
SMILES:
Cc1[nH]c(C#N)c(CC2CCCCC2)c1-c1ccc(nc1C(=O)NS(C)(=O)=O)N1CCc2cccc(C(=O)Nc3nc4ccccc4s3)c2C1
: