Target
cAMP and cAMP-inhibited cGMP 3',5'-cyclic phosphodiesterase 10A
Ligand
BDBM209727
Substrate
Meas. Tech.
PDE10 Fluorescence Polarization (FP) Assay
Temperature
298.15±n/a K
Ki
1.547±n/a nM
Comments
extracted
Citation
 Kuduk, SDMcComas, CCReger, TS Substituted pyridone derivatives as PDE10 inhibitors US Patent  US9273033 Publication Date 3/1/2016 
Target
Name:
cAMP and cAMP-inhibited cGMP 3',5'-cyclic phosphodiesterase 10A
Synonyms:
3',5'-cyclic phosphodiesterase PDE10_HUMAN Phosphodiesterase 10A
Type:
Protein
Mol. Mass.:
88412.52
Organism:
Homo sapiens (Human)
Description:
Q9Y233
Residue:
779
  
Inhibitor
Name:
BDBM209727
Synonyms:
US9273033, 25
Type:
Small organic molecule
Emp. Form.:
C21H21FN4O2
Mol. Mass.:
380.4154
SMILES:
Cc1ccc(nc1)[C@H]1C[C@@H]1COc1nc(C)ncc1-c1cc(F)c(=O)n(C)c1
: