Target
Ephrin type-A receptor 2 [596-900]
Ligand
BDBM4552
Substrate
Meas. Tech.
HotSpot Kinase Activity Assay
IC50
2.0±0.0 nM
Citation
 Heinzlmeir, SKudlinzki, DSreeramulu, SKlaeger, SGande, SLLinhard, VWilhelm, MQiao, HHelm, DRuprecht, BSaxena, KMédard, GSchwalbe, HKuster, B Chemical Proteomics and Structural Biology Define EPHA2 Inhibition by Clinical Kinase Drugs. ACS Chem Biol 11:3400-3411 (2016)  
Target
Name:
Ephrin type-A receptor 2 [596-900]
Synonyms:
ECK EPHA2_HUMAN | Ephrin type-A receptor 2 (EPHA2)
Type:
Protein
Mol. Mass.:
34367.96
Organism:
Homo sapiens (Human)
Description:
EPHA2 truncation (596-900 aa); 519U
Residue:
305
  
Inhibitor
Name:
BDBM4552
Synonyms:
4-[(2,4-Dichloro-5-methoxyphenyl)amino]-6-methoxy-7-[3-(4-methyl-1-piperazinyl)propoxy]-3-quinolinecarbonitrile BOSUTINIB SKI-606
Type:
Small organic molecule
Emp. Form.:
C26H29Cl2N5O3
Mol. Mass.:
530.446
SMILES:
COc1cc(Nc2c(cnc3cc(OCCCN4CCN(C)CC4)c(OC)cc23)C#N)c(Cl)cc1Cl
: