Target
Cannabinoid receptor 2
Ligand
BDBM210473
Substrate
Meas. Tech.
cAMP Assay
Temperature
310.15±n/a K
EC50
52.2±n/a nM
Comments
extracted
Citation
 Bissantz, CGrether, UHebeisen, PKimbara, ALiu, QNettekoven, MPrunotto, MRoever, SRogers-Evans, MSchulz-Gasch, TUllmer, CWang, ZYang, W Pyridine derivatives as agonists of the CB2 receptor US Patent  US9290451 Publication Date 3/22/2016 
Target
Name:
Cannabinoid receptor 2
Synonyms:
CANNABINOID CB2 CB2 CB2B CNR2_HUMAN Cannabinoid CB2 receptor Cannabinoid receptor 2 (CB2R) | hCB2
Type:
G Protein-Coupled Receptor (GPCR)
Mol. Mass.:
39690.94
Organism:
Homo sapiens (Human)
Description:
P34972
Residue:
360
  
Inhibitor
Name:
BDBM210473
Synonyms:
US9290451, 187
Type:
Small organic molecule
Emp. Form.:
C21H24FN3O3
Mol. Mass.:
385.432
SMILES:
CC(C)C[C@H](NC(=O)c1ccc(C2CC2)c(Oc2ccc(F)cc2)n1)C(N)=O
: