Target
Acetyl-CoA carboxylase 2 [129-967]
Ligand
BDBM212627
Substrate
Meas. Tech.
Spectrophotometric 384 Well Assay
pH
7.5±n/a
IC50
286±n/a nM
Comments
extracted
Citation
 Heine, NFleck, MNosse, BRoth, GJ Pyrrolidine derivatives, pharmaceutical compositions and uses thereof US Patent  US9278954 Publication Date 3/8/2016 
Target
Name:
Acetyl-CoA carboxylase 2 [129-967]
Synonyms:
ACACB ACC2 Acetyl-CoA carboxylase 2 (ACC2)
Type:
Enzyme
Mol. Mass.:
92599.28
Organism:
Homo sapiens (Human)
Description:
O00763 lacks the 128 amino acids at the N-terminus
Residue:
839
  
Inhibitor
Name:
BDBM212627
Synonyms:
US9278954, 1.18
Type:
Small organic molecule
Emp. Form.:
C25H33FN4O2
Mol. Mass.:
440.5535
SMILES:
CCCNc1nccc(N2CC[C@H](C2)Oc2ccc(cc2)C(C)C(=O)NCC(C)=C)c1F
: