Target
Tyrosine-protein kinase ABL1 [64-515]
Ligand
BDBM213596
Substrate
Meas. Tech.
Caliper ABL
pH
7.5±n/a
Temperature
303.15±n/a K
IC50
0.2±n/a nM
Comments
extracted
Citation
 Furet, PGrotzfeld, RMJahnke, WJones, DBManley, PWMarzinzik, APelle, XFSalem, BSchoepfer, JSpieser, EA Compounds and compositions for inhibiting the activity of ABL1, ABL2 and BCR-ABL1 US Patent  US9278981 Publication Date 3/8/2016 
Target
Name:
Tyrosine-protein kinase ABL1 [64-515]
Synonyms:
ABL ABL1_HUMAN Tyrosine-protein kinase ABL1 Tyrosine-protein kinase ABL1 (ABL) | Tyrosine-protein kinase ABL1 (ABL1)
Type:
Enzyme Catalytic Domain
Mol. Mass.:
51539.77
Organism:
Homo sapiens (Human)
Description:
aa 64-515
Residue:
452
  
Inhibitor
Name:
BDBM213596
Synonyms:
US9278981, 188
Type:
Small organic molecule
Emp. Form.:
C23H18F3N5O2S
Mol. Mass.:
485.482
SMILES:
O[C@@H]1CCN(C1)c1ncc(cc1-c1cncc(c1)C#N)C(=O)Nc1ccc(SC(F)(F)F)cc1
: