Target
Poly [ADP-ribose] polymerase 1
Ligand
BDBM214228
Substrate
Meas. Tech.
PARP Enzyme Inhibition Assay
pH
8±n/a
Ki
0.7±n/a nM
Comments
extracted
Citation
 Gandhi, VBGiranda, VLGong, JPenning, TDZhu, G Inhibitors of poly(ADP-ribose)polymerase US Patent  US9283222 Publication Date 3/15/2016 
Target
Name:
Poly [ADP-ribose] polymerase 1
Synonyms:
(ARTD1 or PARP1) 2.4.2.30 ADPRT ARTD1 Human diphtheria toxin-like ADP-ribosyltransferase (ARTD1 or PARP1) NT-PARP-1 PARP1 PPOL Poly [ADP-ribose] polymerase 1 (PARP) Poly [ADP-ribose] polymerase 1 (PARP1) Poly [ADP-ribose] polymerase 1, 28-kDa form Poly [ADP-ribose] polymerase 1, processed C-terminus Poly [ADP-ribose] polymerase-1 Poly(ADP-ribose) polymerase-1 (ARTD1/PARP1) Protein poly-ADP-ribosyltransferase PARP1 | Synonyms=ADPRT
Type:
Mol. Mass.:
113114.22
Organism:
Homo sapiens (Human)
Description:
P09874
Residue:
1014
  
Inhibitor
Name:
BDBM214228
Synonyms:
US9283222, 291
Type:
Small organic molecule
Emp. Form.:
C20H18FN3O3
Mol. Mass.:
367.3736
SMILES:
Fc1ccc(Cc2n[nH]c(=O)c3CCCCc23)cc1N1C(=O)C2CC2C1=O
: